﻿_id,nationality,nationality_en,province,province_en,gender,gender_en,age,infected,reinfected,reinfected_date,recovered,death,recovered_date,localtrans,foreigntrans,active,created_at,modified_at,reference
1,ចិន,Chinese,ព្រះសីហនុ,Preah Sihanouk,បុរស,Male,60,1,,,1,0,2020-02-10T00:00:00,0,1,0,2020-01-27T00:00:00,2020-02-10T00:00:00,https://khcovid19.com/api/
2,ខ្មែរ,Khmer,សៀមរាប,Siem Reap,បុរស,Male,38,1,,,1,0,2020-03-29T00:00:00,1,0,0,2020-03-07T00:00:00,2020-03-29T00:00:00,https://khcovid19.com/api/
3,អង់គ្លេស,English,កំពង់ចាម,Kampong Cham,ស្ត្រី,Female,65,1,,,1,0,2020-03-21T00:00:00,0,1,0,2020-03-10T00:00:00,2020-03-21T00:00:00,https://khcovid19.com/api/
4,អង់គ្លេស,English,កំពង់ចាម,Kampong Cham,បុរស,Male,73,1,,,1,0,2020-03-28T00:00:00,0,1,0,2020-03-12T00:00:00,2020-03-28T00:00:00,https://khcovid19.com/api/
5,អង់គ្លេស,English,កំពង់ចាម,Kampong Cham,ស្ត្រី,Female,69,1,,,1,0,2020-03-28T00:00:00,0,1,0,2020-03-12T00:00:00,2020-03-28T00:00:00,https://khcovid19.com/api/
6,កាណាដា,Canadian,រាជធានីភ្នំពេញ,Phnom Penh,បុរស,Male,49,1,,,1,0,2020-04-18T00:41:00,0,1,0,2020-03-13T00:00:00,,https://khcovid19.com/api/
7,ប៊ែលហ្ស៊ិក,Belgium,រាជធានីភ្នំពេញ,Phnom Penh,បុរស,Male,33,1,,,1,0,2020-04-01T00:00:00,0,1,0,2020-03-13T00:00:00,2020-04-01T00:00:00,https://khcovid19.com/api/
8,បារាំង,French,រាជធានីភ្នំពេញ,Phnom Penh,បុរស,Male,35,1,,,1,0,2020-04-27T02:27:18,0,1,0,2020-03-15T00:00:00,,https://khcovid19.com/api/
9,ខ្មែរ,Khmer,រាជធានីភ្នំពេញ,Phnom Penh,បុរស,Male,39,1,,,1,0,2020-04-03T00:00:00,0,1,0,2020-03-15T00:00:00,2020-04-03T00:00:00,https://khcovid19.com/api/
10,បារាំង,French,រាជធានីភ្នំពេញ,Phnom Penh,បុរស,Male,0.4,1,,,1,0,2020-04-02T00:00:00,0,1,0,2020-03-15T00:00:00,2020-04-02T00:00:00,https://khcovid19.com/api/
11,ខ្មែរ,Khmer,ព្រះវិហារ,Preah Vihear,បុរស,Male,35,1,,,1,0,2020-04-10T01:27:24,0,1,0,2020-03-15T00:00:00,,https://khcovid19.com/api/
12,ខ្មែរ,Khmer,ព្រះវិហារ,Preah Vihear,បុរស,Male,39,1,,,1,0,2020-03-28T00:00:00,0,1,0,2020-03-15T00:00:00,2020-03-28T00:00:00,https://khcovid19.com/api/
13,ខ្មែរ,Khmer,បន្ទាយមានជ័យ,Banteay Meanchey,បុរស,Male,41,1,,,1,0,2020-03-27T00:00:00,0,1,0,2020-03-16T00:00:00,2020-03-27T00:00:00,https://khcovid19.com/api/
14,ខ្មែរ,Khmer,បន្ទាយមានជ័យ,Banteay Meanchey,បុរស,Male,35,1,,,1,0,2020-03-29T00:00:00,0,1,0,2020-03-16T00:00:00,2020-03-29T00:00:00,https://khcovid19.com/api/
15,ខ្មែរ,Khmer,រាជធានីភ្នំពេញ,Phnom Penh,បុរស,Male,63,1,,,1,0,2020-03-28T00:00:00,0,1,0,2020-03-16T00:00:00,2020-03-28T00:00:00,https://khcovid19.com/api/
16,ខ្មែរ,Khmer,រាជធានីភ្នំពេញ,Phnom Penh,បុរស,Male,64,1,,,1,0,2020-03-27T00:00:00,0,1,0,2020-03-16T00:00:00,2020-03-27T00:00:00,https://khcovid19.com/api/
17,ខ្មែរ,Khmer,កំពង់ឆ្នាំង,Kampong Chhnang,បុរស,Male,75,1,,,1,0,2020-05-12T01:13:27,0,1,0,2020-03-16T00:00:00,,https://khcovid19.com/api/
18,ខ្មែរ,Khmer,កំពង់ឆ្នាំង,Kampong Chhnang,បុរស,Male,28,1,,,1,0,2020-04-06T00:00:00,0,1,0,2020-03-16T00:00:00,2020-04-07T00:00:00,https://khcovid19.com/api/
19,ខ្មែរ,Khmer,បាត់ដំបង,Battambang,បុរស,Male,45,1,,,1,0,2020-04-15T01:55:14,0,1,0,2020-03-16T00:00:00,,https://khcovid19.com/api/
20,ខ្មែរ,Khmer,បាត់ដំបង,Battambang,បុរស,Male,42,1,,,1,0,2020-03-24T00:00:00,0,1,0,2020-03-16T00:00:00,2020-03-24T00:00:00,https://khcovid19.com/api/
21,ខ្មែរ,Khmer,បាត់ដំបង,Battambang,បុរស,Male,30,1,,,1,0,2020-03-28T00:00:00,0,1,0,2020-03-16T00:00:00,2020-03-28T00:00:00,https://khcovid19.com/api/
22,ខ្មែរ,Khmer,បាត់ដំបង,Battambang,បុរស,Male,41,1,,,1,0,2020-03-24T00:00:00,0,1,0,2020-03-16T00:00:00,2020-03-24T00:00:00,https://khcovid19.com/api/
23,ខ្មែរ,Khmer,កែប,Kep,បុរស,Male,30,1,,,1,0,2020-03-31T00:00:00,0,1,0,2020-03-16T00:00:00,2020-03-31T00:00:00,https://khcovid19.com/api/
24,ខ្មែរ,Khmer,ត្បូងឃ្មុំ,Thbong Khmom,បុរស,Male,61,1,,,1,0,2020-03-24T00:00:00,0,1,0,2020-03-16T00:00:00,2020-03-24T00:00:00,https://khcovid19.com/api/
25,ខ្មែរ,Khmer,សៀមរាប,Siem Reap,បុរស,Male,40,1,,,1,0,2020-04-01T00:00:00,0,1,0,2020-03-17T00:00:00,2020-04-01T00:00:00,https://khcovid19.com/api/
26,ខ្មែរ,Khmer,រាជធានីភ្នំពេញ,Phnom Penh,បុរស,Male,27,1,,,1,0,2020-03-28T00:00:00,0,1,0,2020-03-17T00:00:00,2020-03-28T00:00:00,https://khcovid19.com/api/
27,ខ្មែរ,Khmer,រាជធានីភ្នំពេញ,Phnom Penh,បុរស,Male,40,1,1,2020-04-09T03:57:57,1,0,2020-04-15T01:56:13,0,1,0,2020-03-17T00:00:00,2020-04-07T00:00:00,https://khcovid19.com/api/
28,ខ្មែរ,Khmer,កំពង់ឆ្នាំង,Kampong Chhnang,បុរស,Male,36,1,,,1,0,2020-03-28T00:00:00,0,1,0,2020-03-17T00:00:00,2020-03-28T00:00:00,https://khcovid19.com/api/
29,ម៉ាឡេស៊ី,Malaysian,កែប,Kep,បុរស,Male,58,1,,,1,0,2020-04-10T01:27:49,0,1,0,2020-03-17T00:00:00,,https://khcovid19.com/api/
30,ម៉ាឡេស៊ី,Malaysian,កែប,Kep,បុរស,Male,61,1,,,1,0,2020-03-31T00:00:00,0,1,0,2020-03-17T00:00:00,2020-03-31T00:00:00,https://khcovid19.com/api/
31,ម៉ាឡេស៊ី,Malaysian,កែប,Kep,បុរស,Male,66,1,,,1,0,2020-04-25T00:12:05,0,1,0,2020-03-17T00:00:00,,https://khcovid19.com/api/
32,ខ្មែរ,Khmer,កោះកុង,Koh Kong,បុរស,Male,57,1,,,1,0,2020-03-26T00:00:00,0,1,0,2020-03-17T00:00:00,2020-03-26T00:00:00,https://khcovid19.com/api/
33,ខ្មែរ,Khmer,ត្បូងឃ្មុំ,Thbong Khmom,បុរស,Male,53,1,,,1,0,2020-03-24T00:00:00,0,1,0,2020-03-17T00:00:00,2020-03-24T00:00:00,https://khcovid19.com/api/
34,ម៉ាឡេស៊ី,Malaysian,កំពត,Kampot,បុរស,Male,60,1,,,1,0,2020-04-03T00:00:00,0,1,0,2020-03-18T00:00:00,2020-04-03T00:00:00,https://khcovid19.com/api/
35,ម៉ាឡេស៊ី,Malaysian,កំពត,Kampot,បុរស,Male,64,1,,,1,0,2020-04-03T00:00:00,0,1,0,2020-03-18T00:00:00,2020-04-03T00:00:00,https://khcovid19.com/api/
36,ខ្មែរ,Khmer,ត្បូងឃ្មុំ,Thbong Khmom,បុរស,Male,71,1,,,1,0,2020-03-25T00:00:00,0,1,0,2020-03-18T00:00:00,2020-03-25T00:00:00,https://khcovid19.com/api/
37,ខ្មែរ,Khmer,ត្បូងឃ្មុំ,Thbong Khmom,បុរស,Male,52,1,,,1,0,2020-03-25T00:00:00,0,1,0,2020-03-18T00:00:00,2020-03-25T00:00:00,https://khcovid19.com/api/
38,ខ្មែរ,Khmer,បាត់ដំបង,Battambang,ស្ត្រី,Female,35,1,,,1,0,2020-04-03T00:00:00,1,0,0,2020-03-19T00:00:00,2020-04-03T00:00:00,https://khcovid19.com/api/
39,ខ្មែរ,Khmer,បាត់ដំបង,Battambang,ស្ត្រី,Female,41,1,,,1,0,2020-04-15T01:56:28,1,0,0,2020-03-19T00:00:00,,https://khcovid19.com/api/
40,ខ្មែរ,Khmer,កណ្ដាល,Kandal,បុរស,Male,60,1,,,1,0,2020-04-03T00:00:00,0,1,0,2020-03-19T00:00:00,2020-04-03T00:00:00,https://khcovid19.com/api/
41,ខ្មែរ,Khmer,រាជធានីភ្នំពេញ,Phnom Penh,បុរស,Male,34,1,,,1,0,2020-03-25T00:00:00,0,1,0,2020-03-19T00:00:00,2020-03-25T00:00:00,https://khcovid19.com/api/
42,ម៉ាឡេស៊ី,Malaysian,កំពង់ចាម,Kampong Cham,បុរស,Male,26,1,,,1,0,2020-04-05T00:00:00,0,1,0,2020-03-19T00:00:00,2020-04-05T00:00:00,https://khcovid19.com/api/
43,ម៉ាឡេស៊ី,Malaysian,កំពង់ចាម,Kampong Cham,បុរស,Male,34,1,,,1,0,2020-04-12T01:44:28,0,1,0,2020-03-19T00:00:00,,https://khcovid19.com/api/
44,ម៉ាឡេស៊ី,Malaysian,កំពង់ចាម,Kampong Cham,បុរស,Male,34,1,,,1,0,2020-04-15T01:54:10,0,1,0,2020-03-19T00:00:00,,https://khcovid19.com/api/
45,ម៉ាឡេស៊ី,Malaysian,កំពង់ចាម,Kampong Cham,បុរស,Male,51,1,,,1,0,2020-04-15T01:54:21,0,1,0,2020-03-19T00:00:00,,https://khcovid19.com/api/
46,ម៉ាឡេស៊ី,Malaysian,កំពង់ចាម,Kampong Cham,បុរស,Male,58,1,,,1,0,2020-04-12T01:44:48,0,1,0,2020-03-19T00:00:00,,https://khcovid19.com/api/
47,ម៉ាឡេស៊ី,Malaysian,កំពង់ចាម,Kampong Cham,បុរស,Male,62,1,,,1,0,2020-04-04T00:00:00,0,1,0,2020-03-19T00:00:00,2020-04-04T00:00:00,https://khcovid19.com/api/
48,ម៉ាឡេស៊ី,Malaysian,កំពង់ចាម,Kampong Cham,បុរស,Male,39,1,,,1,0,2020-04-05T00:00:00,0,1,0,2020-03-20T00:00:00,2020-04-05T00:00:00,https://khcovid19.com/api/
49,ខ្មែរ,Khmer,រាជធានីភ្នំពេញ,Phnom Penh,បុរស,Male,33,1,,,1,0,2020-03-25T00:00:00,1,0,0,2020-03-20T00:00:00,2020-03-25T00:00:00,https://khcovid19.com/api/
50,ខ្មែរ,Khmer,បាត់ដំបង,Battambang,បុរស,Male,48,1,,,1,0,2020-04-20T02:36:42,0,1,0,2020-03-20T00:00:00,,https://khcovid19.com/api/
51,ខ្មែរ,Khmer,បាត់ដំបង,Battambang,បុរស,Male,38,1,,,1,0,2020-04-18T00:41:43,0,1,0,2020-03-20T00:00:00,,https://khcovid19.com/api/
52,បារាំង,French,ព្រះសីហនុ,Preah Sihanouk,បុរស,Male,67,1,,,1,0,2020-04-08T01:52:48,0,1,0,2020-03-21T00:00:00,,https://khcovid19.com/api/
53,បារាំង,French,ព្រះសីហនុ,Preah Sihanouk,បុរស,Male,80,1,,,1,0,2020-04-16T01:44:48,0,1,0,2020-03-21T00:00:00,,https://khcovid19.com/api/
54,បារាំង,French,ព្រះសីហនុ,Preah Sihanouk,ស្ត្រី,Female,48,1,,,1,0,2020-04-11T01:31:51,0,1,0,2020-03-22T00:00:00,,https://khcovid19.com/api/
55,បារាំង,French,ព្រះសីហនុ,Preah Sihanouk,ស្ត្រី,Female,59,1,,,1,0,2020-04-01T00:00:00,0,1,0,2020-03-22T00:00:00,2020-04-01T00:00:00,https://khcovid19.com/api/
56,បារាំង,French,ព្រះសីហនុ,Preah Sihanouk,ស្ត្រី,Female,66,1,,,1,0,2020-04-14T01:01:08,0,1,0,2020-03-22T00:00:00,,https://khcovid19.com/api/
57,បារាំង,French,ព្រះសីហនុ,Preah Sihanouk,ស្ត្រី,Female,61,1,,,1,0,2020-04-01T00:00:00,0,1,0,2020-03-22T00:00:00,2020-04-01T00:00:00,https://khcovid19.com/api/
58,បារាំង,French,ព្រះសីហនុ,Preah Sihanouk,ស្ត្រី,Female,63,1,,,1,0,2020-04-01T00:00:00,0,1,0,2020-03-22T00:00:00,2020-04-01T00:00:00,https://khcovid19.com/api/
59,បារាំង,French,ព្រះសីហនុ,Preah Sihanouk,ស្ត្រី,Female,59,1,,,1,0,2020-04-14T01:27:55,0,1,0,2020-03-22T00:00:00,2020-04-14T01:27:48,https://khcovid19.com/api/
60,បារាំង,French,ព្រះសីហនុ,Preah Sihanouk,ស្ត្រី,Female,62,1,,,1,0,2020-04-01T00:00:00,0,1,0,2020-03-22T00:00:00,2020-04-01T00:00:00,https://khcovid19.com/api/
61,បារាំង,French,ព្រះសីហនុ,Preah Sihanouk,ស្ត្រី,Female,66,1,,,1,0,2020-04-03T00:00:00,0,1,0,2020-03-22T00:00:00,2020-04-03T00:00:00,https://khcovid19.com/api/
62,បារាំង,French,ព្រះសីហនុ,Preah Sihanouk,ស្ត្រី,Female,59,1,,,1,0,2020-04-03T00:00:00,0,1,0,2020-03-22T00:00:00,2020-04-03T00:00:00,https://khcovid19.com/api/
63,បារាំង,French,ព្រះសីហនុ,Preah Sihanouk,ស្ត្រី,Female,63,1,,,1,0,2020-04-03T00:00:00,0,1,0,2020-03-22T00:00:00,2020-04-03T00:00:00,https://khcovid19.com/api/
64,បារាំង,French,ព្រះសីហនុ,Preah Sihanouk,ស្ត្រី,Female,76,1,,,1,0,2020-04-03T00:00:00,0,1,0,2020-03-22T00:00:00,2020-04-03T00:00:00,https://khcovid19.com/api/
65,បារាំង,French,ព្រះសីហនុ,Preah Sihanouk,ស្ត្រី,Female,60,1,,,1,0,2020-04-14T01:01:45,0,1,0,2020-03-22T00:00:00,,https://khcovid19.com/api/
66,បារាំង,French,ព្រះសីហនុ,Preah Sihanouk,ស្ត្រី,Female,63,1,,,1,0,2020-04-09T01:33:15,0,1,0,2020-03-22T00:00:00,,https://khcovid19.com/api/
67,បារាំង,French,ព្រះសីហនុ,Preah Sihanouk,ស្ត្រី,Female,60,1,,,1,0,2020-04-14T01:02:08,0,1,0,2020-03-22T00:00:00,,https://khcovid19.com/api/
68,បារាំង,French,ព្រះសីហនុ,Preah Sihanouk,ស្ត្រី,Female,69,1,,,1,0,2020-04-01T00:00:00,0,1,0,2020-03-22T00:00:00,2020-04-01T00:00:00,https://khcovid19.com/api/
69,បារាំង,French,ព្រះសីហនុ,Preah Sihanouk,ស្ត្រី,Female,69,1,,,1,0,2020-04-14T01:02:42,0,1,0,2020-03-22T00:00:00,,https://khcovid19.com/api/
70,បារាំង,French,ព្រះសីហនុ,Preah Sihanouk,ស្ត្រី,Female,59,1,,,1,0,2020-04-09T01:36:37,0,1,0,2020-03-22T00:00:00,,https://khcovid19.com/api/
71,បារាំង,French,ព្រះសីហនុ,Preah Sihanouk,បុរស,Male,66,1,,,1,0,2020-04-01T00:00:00,0,1,0,2020-03-22T00:00:00,2020-04-01T00:00:00,https://khcovid19.com/api/
72,បារាំង,French,ព្រះសីហនុ,Preah Sihanouk,បុរស,Male,61,1,,,1,0,2020-04-14T01:26:26,0,1,0,2020-03-22T00:00:00,2020-04-14T01:26:08,https://khcovid19.com/api/
73,បារាំង,French,ព្រះសីហនុ,Preah Sihanouk,បុរស,Male,69,1,,,1,0,2020-03-28T00:00:00,0,1,0,2020-03-22T00:00:00,2020-03-28T00:00:00,https://khcovid19.com/api/
74,បារាំង,French,ព្រះសីហនុ,Preah Sihanouk,បុរស,Male,70,1,,,1,0,2020-04-03T00:00:00,0,1,0,2020-03-22T00:00:00,2020-04-03T00:00:00,https://khcovid19.com/api/
75,បារាំង,French,ព្រះសីហនុ,Preah Sihanouk,បុរស,Male,63,1,,,1,0,2020-04-03T00:00:00,0,1,0,2020-03-22T00:00:00,2020-04-03T00:00:00,https://khcovid19.com/api/
76,បារាំង,French,ព្រះសីហនុ,Preah Sihanouk,បុរស,Male,63,1,,,1,0,2020-04-03T00:00:00,0,1,0,2020-03-22T00:00:00,2020-04-03T00:00:00,https://khcovid19.com/api/
77,បារាំង,French,ព្រះសីហនុ,Preah Sihanouk,បុរស,Male,63,1,,,1,0,2020-04-03T00:00:00,0,1,0,2020-03-22T00:00:00,2020-04-03T00:00:00,https://khcovid19.com/api/
78,បារាំង,French,ព្រះសីហនុ,Preah Sihanouk,បុរស,Male,52,1,,,1,0,2020-04-01T00:00:00,0,1,0,2020-03-22T00:00:00,2020-04-01T00:00:00,https://khcovid19.com/api/
79,បារាំង,French,ព្រះសីហនុ,Preah Sihanouk,បុរស,Male,63,1,,,1,0,2020-04-08T02:45:56,0,1,0,2020-03-22T00:00:00,2020-04-08T02:42:46,https://khcovid19.com/api/
80,បារាំង,French,ព្រះសីហនុ,Preah Sihanouk,បុរស,Male,62,1,,,1,0,2020-04-09T01:34:52,0,1,0,2020-03-22T00:00:00,,https://khcovid19.com/api/
81,បារាំង,French,ព្រះសីហនុ,Preah Sihanouk,បុរស,Male,63,1,,,1,0,2020-04-09T03:51:45,0,1,0,2020-03-22T00:00:00,2020-04-09T03:53:03,https://khcovid19.com/api/
82,បារាំង,French,ព្រះសីហនុ,Preah Sihanouk,បុរស,Male,58,1,,,1,0,2020-04-14T00:58:56,0,1,0,2020-03-22T00:00:00,,https://khcovid19.com/api/
83,ខ្មែរ,Khmer,ព្រះសីហនុ,Preah Sihanouk,បុរស,Male,39,1,,,1,0,2020-04-03T00:00:00,1,0,0,2020-03-22T00:00:00,2020-04-03T00:00:00,https://khcovid19.com/api/
84,ខ្មែរ,Khmer,ព្រះសីហនុ,Preah Sihanouk,បុរស,Male,33,1,,,1,0,2020-04-14T01:07:03,1,0,0,2020-03-22T00:00:00,,https://khcovid19.com/api/
85,ខ្មែរ,Khmer,កំពង់ចាម,Kampong Cham,បុរស,Male,45,1,,,1,0,2020-04-10T01:27:06,0,1,0,2020-03-23T00:00:00,,https://khcovid19.com/api/
86,ខ្មែរ,Khmer,កោះកុង,Koh Kong,បុរស,Male,36,1,,,1,0,2020-04-11T01:37:55,0,1,0,2020-03-23T00:00:00,,https://khcovid19.com/api/
87,បារាំង,French,រាជធានីភ្នំពេញ,Phnom Penh,ស្ត្រី,Female,28,1,,,1,0,2020-04-27T02:27:07,1,0,0,2020-03-23T00:00:00,,https://khcovid19.com/api/
88,អង់គ្លេស,English,កំពង់ចាម,Kampong Cham,បុរស,Male,61,1,,,1,0,2020-04-18T00:39:28,0,1,0,2020-03-24T00:00:00,,https://khcovid19.com/api/
89,អង់គ្លេស,English,កំពង់ចាម,Kampong Cham,ស្ត្រី,Female,79,1,,,1,0,2020-04-09T01:31:47,0,1,0,2020-03-24T00:00:00,,https://khcovid19.com/api/
90,អាមេរិក,American,កំពង់ចាម,Kampong Cham,បុរស,Male,59,1,,,1,0,2020-04-18T00:40:11,0,1,0,2020-03-24T00:00:00,,https://khcovid19.com/api/
91,អាមេរិក,American,កំពង់ចាម,Kampong Cham,ស្ត្រី,Female,62,1,,,1,0,2020-04-18T00:40:26,0,1,0,2020-03-24T00:00:00,,https://khcovid19.com/api/
92,បារាំង,French,ព្រះសីហនុ,Preah Sihanouk,បុរស,Male,64,1,,,1,0,2020-04-03T00:00:00,0,1,0,2020-03-25T00:00:00,2020-04-03T00:00:00,https://khcovid19.com/api/
93,បារាំង,French,ព្រះសីហនុ,Preah Sihanouk,ស្ត្រី,Female,60,1,,,1,0,2020-04-14T01:04:07,0,1,0,2020-03-25T00:00:00,,https://khcovid19.com/api/
94,ខ្មែរ,Khmer,រាជធានីភ្នំពេញ,Phnom Penh,បុរស,Male,28,1,,,1,0,2020-04-08T01:59:45,0,1,0,2020-03-25T00:00:00,2020-04-08T02:40:24,https://khcovid19.com/api/
95,ខ្មែរ,Khmer,កណ្ដាល,Kandal,បុរស,Male,59,1,,,1,0,2020-04-10T01:25:14,1,0,0,2020-03-25T00:00:00,,https://khcovid19.com/api/
96,ខ្មែរ,Khmer,សៀមរាប,Siem Reap,បុរស,Male,37,1,,,1,0,2020-04-25T00:12:59,1,0,0,2020-03-25T00:00:00,,https://khcovid19.com/api/
97,ឥណ្ឌូនេស៊ី,Indonesian,សៀមរាប,Siem Reap,បុរស,Male,41,1,,,1,0,2020-04-14T01:08:22,0,1,0,2020-03-26T00:00:00,,https://khcovid19.com/api/
98,ឥណ្ឌូនេស៊ី,Indonesian,សៀមរាប,Siem Reap,បុរស,Male,44,1,,,1,0,2020-04-14T01:08:38,0,1,0,2020-03-26T00:00:00,,https://khcovid19.com/api/
99,ខ្មែរ,Khmer,រាជធានីភ្នំពេញ,Phnom Penh,បុរស,Male,62,1,,,1,0,2020-04-11T01:35:03,0,1,0,2020-03-26T00:00:00,,https://khcovid19.com/api/
100,ខ្មែរ,Khmer,រាជធានីភ្នំពេញ,Phnom Penh,ស្ត្រី,Female,61,1,,,1,0,2020-04-06T00:00:00,0,1,0,2020-03-26T00:00:00,2020-04-06T00:00:00,https://khcovid19.com/api/
101,ខ្មែរ,Khmer,រាជធានីភ្នំពេញ,Phnom Penh,បុរស,Male,39,1,,,1,0,2020-04-14T01:09:47,0,1,0,2020-03-26T00:00:00,,https://khcovid19.com/api/
102,ខ្មែរ,Khmer,រាជធានីភ្នំពេញ,Phnom Penh,ស្ត្រី,Female,37,1,,,1,0,2020-04-08T01:54:49,0,1,0,2020-03-26T00:00:00,,https://khcovid19.com/api/
103,ខ្មែរ,Khmer,បន្ទាយមានជ័យ,Banteay Meanchey,ស្ត្រី,Female,36,1,,,1,0,2020-05-16T01:15:35,1,0,0,2020-03-28T00:00:00,,https://khcovid19.com/api/
104,ខ្មែរ,Khmer,បន្ទាយមានជ័យ,Banteay Meanchey,បុរស,Male,30,1,,,1,0,2020-04-06T00:00:00,1,0,0,2020-03-29T00:00:00,2020-04-06T00:00:00,https://khcovid19.com/api/
105,ខ្មែរ,Khmer,រាជធានីភ្នំពេញ,Phnom Penh,បុរស,Male,36,1,,,1,0,2020-04-08T01:54:01,0,1,0,2020-03-29T00:00:00,,https://khcovid19.com/api/
106,ខ្មែរ,Khmer,រាជធានីភ្នំពេញ,Phnom Penh,ស្ត្រី,Female,20,1,,,1,0,2020-04-25T00:13:44,0,1,0,2020-03-29T00:00:00,,https://khcovid19.com/api/
107,បារាំង,French,រាជធានីភ្នំពេញ,Phnom Penh,បុរស,Male,61,1,,,1,0,2020-04-16T01:45:44,0,1,0,2020-03-29T00:00:00,,https://khcovid19.com/api/
108,ខ្មែរ,Khmer,សៀមរាប,Siem Reap,ស្ត្រី,Female,39,1,,,1,0,2020-04-20T11:51:07,1,0,0,2020-03-30T00:00:00,,https://khcovid19.com/api/
109,ខ្មែរ,Khmer,សៀមរាប,Siem Reap,បុរស,Male,12,1,,,1,0,2020-04-19T00:13:05,1,0,0,2020-03-30T00:00:00,,https://khcovid19.com/api/
110,ខ្មែរ,Khmer,ព្រះសីហនុ,Preah Sihanouk,បុរស,Male,58,1,,,1,0,2020-05-02T10:29:29,1,0,0,2020-04-01T00:00:00,,https://khcovid19.com/api/
111,បារាំង,French,ព្រះសីហនុ,Preah Sihanouk,បុរស,Male,66,1,,,1,0,2020-04-14T01:23:30,0,1,0,2020-04-02T00:00:00,2020-04-14T01:23:09,https://khcovid19.com/api/
112,បារាំង,French,ព្រះសីហនុ,Preah Sihanouk,ស្ត្រី,Female,67,1,,,1,0,2020-04-09T01:37:31,0,1,0,2020-04-02T00:00:00,,https://khcovid19.com/api/
113,បារាំង,French,ព្រះសីហនុ,Preah Sihanouk,ស្ត្រី,Female,59,1,,,1,0,2020-04-14T01:04:49,0,1,0,2020-04-02T00:00:00,,https://khcovid19.com/api/
114,ម៉ាឡេស៊ី,Malaysian,កំពង់ចាម,Kampong Cham,បុរស,Male,40,1,,,1,0,2020-04-05T00:00:00,0,1,0,2020-04-02T00:00:00,2020-04-05T00:00:00,https://khcovid19.com/api/
115,វៀតណាម,Vietnamese,រាជធានីភ្នំពេញ,Phnom Penh,ស្ត្រី,Female,27,1,,,1,0,2020-04-25T00:14:30,1,0,0,2020-04-07T00:00:00,2020-04-11T02:04:47,https://khcovid19.com/api/
116,ខ្មែរ,Khmer,រាជធានីភ្នំពេញ,Phnom Penh,បុរស,Male,47,1,,,1,0,2020-04-21T01:05:57,1,0,0,2020-04-08T01:50:34,,https://khcovid19.com/api/
117,ខ្មែរ,Khmer,រាជធានីភ្នំពេញ,Phnom Penh,ស្ត្រី,Female,45,1,,,1,0,2020-04-21T01:06:14,1,0,0,2020-04-08T01:51:12,,https://khcovid19.com/api/
118,ចិន,Chinese,រាជធានីភ្នំពេញ,Phnom Penh,ស្ត្រី,Female,30,1,,,1,0,2020-04-25T00:22:47,1,0,0,2020-04-09T01:30:29,2020-04-25T00:22:34,https://khcovid19.com/api/
119,វៀតណាម,Vietnamese,រាជធានីភ្នំពេញ,Phnom Penh,ស្ត្រី,Female,34,1,0,,1,0,2020-04-19T00:12:08,1,0,0,2020-04-10T01:24:10,2020-04-11T02:05:14,https://khcovid19.com/api/
120,ចិន,Chinese,រាជធានីភ្នំពេញ,Phnom Penh,ស្ត្រី,Female,31,1,0,,1,0,2020-04-25T00:16:33,1,0,0,2020-04-11T01:30:50,2020-04-11T02:06:37,https://khcovid19.com/api/
121,វៀតណាម,Vietnamese,រាជធានីភ្នំពេញ,Phnom Penh,ស្ត្រី,Female,24,1,0,,1,0,2020-04-25T00:15:00,1,0,0,2020-04-12T01:42:06,,https://khcovid19.com/api/
122,កាណាដា,Canadian,រាជធានីភ្នំពេញ,Phnom Penh,បុរស,Male,50,1,0,,1,0,2020-04-21T01:06:51,1,0,0,2020-04-12T01:43:28,,https://khcovid19.com/api/
123,ខ្មែរ,Khmer,រាជធានីភ្នំពេញ,Phnom Penh,បុរស,Male,26,1,0,,1,0,2020-06-17T01:47:01,0,1,0,2020-05-21T14:11:55,,https://khcovid19.com/api/
124,ខ្មែរ,Khmer,រាជធានីភ្នំពេញ,Phnom Penh,ស្ត្រី,Female,39,1,0,,1,0,2020-05-30T00:25:47,0,1,0,2020-05-23T00:13:08,,https://khcovid19.com/api/
125,ខ្មែរ,Khmer,បន្ទាយមានជ័យ,Banteay Meanchey,បុរស,Male,26,1,0,,1,0,2020-06-08T01:31:46,0,1,0,2020-05-30T00:25:20,,https://khcovid19.com/api/
126,ខ្មែរ,Khmer,រាជធានីភ្នំពេញ,Phnom Penh,បុរស,Male,30,1,0,,1,0,2020-06-10T01:37:11,0,1,0,2020-06-07T01:12:43,,https://khcovid19.com/api/
127,ខ្មែរ,Khmer,រាជធានីភ្នំពេញ,Phnom Penh,បុរស,Male,29,1,0,,1,0,2020-06-29T01:34:21,0,1,0,2020-06-14T01:30:56,,https://khcovid19.com/api/
128,ខ្មែរ,Khmer,រាជធានីភ្នំពេញ,Phnom Penh,បុរស,Male,22,1,0,,1,0,2020-06-21T01:06:22,0,1,0,2020-06-14T01:31:20,,https://khcovid19.com/api/
129,ខ្មែរ,Khmer,រាជធានីភ្នំពេញ,Phnom Penh,បុរស,Male,21,1,0,,1,0,2020-06-24T01:57:19,0,1,0,2020-06-18T02:18:48,,https://khcovid19.com/api/
130,ខ្មែរ,Khmer,រាជធានីភ្នំពេញ,Phnom Penh,បុរស,Male,66,1,0,,1,0,2020-06-27T02:52:03,0,1,0,2020-06-23T02:07:34,,https://khcovid19.com/api/
131,ខ្មែរ,Khmer,រាជធានីភ្នំពេញ,Phnom Penh,ស្ត្រី,Female,29,1,0,,1,0,,0,1,0,2020-06-27T02:55:28,2020-06-27T03:02:55,https://khcovid19.com/api/
132,ខ្មែរ,Khmer,រាជធានីភ្នំពេញ,Phnom Penh,បុរស,Male,23,1,0,,1,0,2020-07-13T05:54:13,0,1,0,2020-06-27T02:55:57,,https://khcovid19.com/api/
133,ខ្មែរ,Khmer,រាជធានីភ្នំពេញ,Phnom Penh,បុរស,Male,24,1,0,,1,0,2020-08-01T00:00:00,0,1,0,2020-06-27T02:56:43,,https://khcovid19.com/api/
134,ខ្មែរ,Khmer,រាជធានីភ្នំពេញ,Phnom Penh,បុរស,Male,22,1,0,,1,0,2020-08-13T00:00:00,0,1,0,2020-06-27T02:57:10,,https://khcovid19.com/api/
135,ខ្មែរ,Khmer,រាជធានីភ្នំពេញ,Phnom Penh,បុរស,Male,26,1,0,,1,0,2020-08-01T00:00:00,0,1,0,2020-06-27T02:57:25,,https://khcovid19.com/api/
136,ខ្មែរ,Khmer,រាជធានីភ្នំពេញ,Phnom Penh,បុរស,Male,26,1,0,,1,0,2020-08-18T00:00:00,0,1,0,2020-06-27T02:57:37,,https://khcovid19.com/api/
137,ខ្មែរ,Khmer,រាជធានីភ្នំពេញ,Phnom Penh,បុរស,Male,25,1,0,,1,0,2020-08-21T00:00:00,0,1,0,2020-06-27T02:58:19,,https://khcovid19.com/api/
138,ឥណ្ឌូនេស៊ី,Indonesian,រាជធានីភ្នំពេញ,Phnom Penh,បុរស,Male,22,1,0,,1,0,2020-07-01T01:18:36,0,1,0,2020-06-27T02:59:18,,https://khcovid19.com/api/
139,ខ្មែរ,Khmer,រាជធានីភ្នំពេញ,Phnom Penh,បុរស,Male,25,1,0,,1,0,2020-08-14T00:00:00,0,1,0,2020-06-27T03:00:53,2020-06-27T03:03:15,https://khcovid19.com/api/
140,ខ្មែរ,Khmer,រាជធានីភ្នំពេញ,Phnom Penh,បុរស,Male,23,1,0,,1,0,,0,1,0,2020-06-28T01:21:27,,https://khcovid19.com/api/
141,ខ្មែរ,Khmer,រាជធានីភ្នំពេញ,Phnom Penh,បុរស,Male,15,1,0,,1,0,2020-07-13T05:53:45,0,1,0,2020-06-28T01:22:54,2020-06-28T01:32:09,https://khcovid19.com/api/
142,ខ្មែរ,Khmer,រាជធានីភ្នំពេញ,Phnom Penh,បុរស,Male,26,1,0,,1,0,2020-08-21T00:00:00,0,1,0,2020-07-13T05:13:36,2020-07-14T02:24:45,https://khcovid19.com/api/
143,ខ្មែរ,Khmer,រាជធានីភ្នំពេញ,Phnom Penh,បុរស,Male,29,1,0,,1,0,,0,1,0,2020-07-13T05:15:14,,https://khcovid19.com/api/
144,ខ្មែរ,Khmer,រាជធានីភ្នំពេញ,Phnom Penh,បុរស,Male,26,1,0,,1,0,,0,1,0,2020-07-13T05:18:23,,https://khcovid19.com/api/
145,ខ្មែរ,Khmer,រាជធានីភ្នំពេញ,Phnom Penh,បុរស,Male,23,1,0,,1,0,,0,1,0,2020-07-13T05:19:04,,https://khcovid19.com/api/
146,ខ្មែរ,Khmer,រាជធានីភ្នំពេញ,Phnom Penh,បុរស,Male,21,1,0,,1,0,2020-07-19T12:28:26,0,1,0,2020-07-13T05:20:32,,https://khcovid19.com/api/
147,ខ្មែរ,Khmer,រាជធានីភ្នំពេញ,Phnom Penh,បុរស,Male,31,1,0,,1,0,,0,1,0,2020-07-13T05:22:27,,https://khcovid19.com/api/
148,ខ្មែរ,Khmer,រាជធានីភ្នំពេញ,Phnom Penh,បុរស,Male,29,1,0,,1,0,2020-08-01T00:00:00,0,1,0,2020-07-13T05:23:50,,https://khcovid19.com/api/
149,ខ្មែរ,Khmer,រាជធានីភ្នំពេញ,Phnom Penh,បុរស,Male,24,1,0,,1,0,2020-08-01T00:00:00,0,1,0,2020-07-13T05:25:13,,https://khcovid19.com/api/
150,ខ្មែរ,Khmer,រាជធានីភ្នំពេញ,Phnom Penh,បុរស,Male,30,1,0,,1,0,2020-07-19T12:29:54,0,1,0,2020-07-13T05:25:52,,https://khcovid19.com/api/
151,ខ្មែរ,Khmer,រាជធានីភ្នំពេញ,Phnom Penh,បុរស,Male,27,1,0,,1,0,2020-08-06T00:00:00,0,1,0,2020-07-13T05:27:28,,https://khcovid19.com/api/
152,ខ្មែរ,Khmer,រាជធានីភ្នំពេញ,Phnom Penh,បុរស,Male,21,1,0,,1,0,2020-07-19T12:29:18,0,1,0,2020-07-13T05:28:40,,https://khcovid19.com/api/
153,ខ្មែរ,Khmer,រាជធានីភ្នំពេញ,Phnom Penh,បុរស,Male,28,1,0,,1,0,,0,1,0,2020-07-13T05:32:47,,https://khcovid19.com/api/
154,ខ្មែរ,Khmer,រាជធានីភ្នំពេញ,Phnom Penh,បុរស,Male,33,1,0,,1,0,2020-08-01T00:00:00,0,1,0,2020-07-13T05:34:37,,https://khcovid19.com/api/
155,ខ្មែរ,Khmer,រាជធានីភ្នំពេញ,Phnom Penh,បុរស,Male,26,1,0,,1,0,,0,1,0,2020-07-13T05:35:57,,https://khcovid19.com/api/
156,ខ្មែរ,Khmer,រាជធានីភ្នំពេញ,Phnom Penh,បុរស,Male,23,1,0,,1,0,2020-08-01T00:00:00,0,1,0,2020-07-13T05:37:01,2020-07-14T01:58:36,https://khcovid19.com/api/
157,ខ្មែរ,Khmer,រាជធានីភ្នំពេញ,Phnom Penh,បុរស,Male,24,1,0,,1,0,,0,1,0,2020-07-14T01:51:25,,https://khcovid19.com/api/
158,ខ្មែរ,Khmer,រាជធានីភ្នំពេញ,Phnom Penh,បុរស,Male,25,1,0,,1,0,,0,1,0,2020-07-14T01:53:11,,https://khcovid19.com/api/
159,ខ្មែរ,Khmer,រាជធានីភ្នំពេញ,Phnom Penh,បុរស,Male,29,1,0,,1,0,,0,1,0,2020-07-14T01:53:46,2020-07-14T03:45:48,https://khcovid19.com/api/
160,ខ្មែរ,Khmer,រាជធានីភ្នំពេញ,Phnom Penh,បុរស,Male,26,1,0,,1,0,,0,1,0,2020-07-14T01:54:16,2020-07-14T03:50:00,https://khcovid19.com/api/
161,ខ្មែរ,Khmer,រាជធានីភ្នំពេញ,Phnom Penh,បុរស,Male,27,1,0,,1,0,,0,1,0,2020-07-14T01:54:38,2020-07-14T03:52:04,https://khcovid19.com/api/
162,ខ្មែរ,Khmer,រាជធានីភ្នំពេញ,Phnom Penh,បុរស,Male,28,1,0,,1,0,,0,1,0,2020-07-14T01:54:59,2020-07-14T03:54:26,https://khcovid19.com/api/
163,ខ្មែរ,Khmer,រាជធានីភ្នំពេញ,Phnom Penh,បុរស,Male,28,1,0,,1,0,2020-08-09T00:00:00,0,1,0,2020-07-14T01:55:17,2020-07-14T03:56:50,https://khcovid19.com/api/
164,ខ្មែរ,Khmer,រាជធានីភ្នំពេញ,Phnom Penh,បុរស,Male,26,1,0,,1,0,2020-08-01T00:00:00,0,1,0,2020-07-14T01:55:32,2020-07-14T03:59:27,https://khcovid19.com/api/